点击回首页
我的浏览记录 | | 帮助?
当前位置:
首页>> 行业软件>> 在线考试系统>> 源文件浏览
[免费版 Free] WebForm,下载次数:252 次 | 关键字: 考试 办公 高校 竞赛 企事业单位

源码截图

源码目录树

;
当前路径:vendor/phpunit/phpunit/tests/end-to-end/loggers/_files/raw_output_StatusTest.txt
PHPUnit %s Sebastian Bergmann and contributors.

Runtime:       %s
Configuration: %stests%ebasic%econfiguration.basic.xml

Set Up Before Class (PHPUnit\SelfTest\Basic\SetUpBeforeClass)
 ✘ One  %f ms
   ┐
   ├ Exception: forcing an Exception in setUpBeforeClass()
   │
   ╵ %stests%ebasic%eunit%eSetUpBeforeClassTest.php:31
   ┴

 ↩ Two  %f ms
   ┐
   ├ Test skipped because of an error in hook method
   ┴

Set Up (PHPUnit\SelfTest\Basic\SetUp)
 ✘ One with set up exception  %f ms
   ┐
   ├ RuntimeException: throw exception in setUp
   │
   ╵ %stests%ebasic%eunit%eSetUpTest.php:29
   ┴

 ✘ Two with set up exception  %f ms
   ┐
   ├ RuntimeException: throw exception in setUp
   │
   ╵ %stests%ebasic%eunit%eSetUpTest.php:29
   ┴

Test result status with and without message
 ✔ Success  %f ms
 ✘ Failure  %f ms
   ┐
   ├ Failed asserting that false is true.
   │
   ╵ %stests%ebasic%eunit%eStatusTest.php:%d
   ┴

 ✘ Error  %f ms
   ┐
   ├ RuntimeException:
   │
   ╵ %stests%ebasic%eunit%eStatusTest.php:%d
   ┴

 ∅ Incomplete  %f ms
   ┐
   ╵ %stests%ebasic%eunit%eStatusTest.php:%d
   ┴

 ↩ Skipped  %f ms
   ┐
   ╵ %stests%ebasic%eunit%eStatusTest.php:%d
   ┴

 ☢ Risky  %f ms
   ┐
   ├ This test did not perform any assertions%w
   ├%w
   ├ %stests%ebasic%eunit%eStatusTest.php:%d%w
   ┴

 ⚠ Warning  %f ms
   ┐
   ╵ %stests%ebasic%eunit%eStatusTest.php:%d
   ┴

 ✔ Success with message  %f ms
 ✘ Failure with message  %f ms
   ┐
   ├ failure with custom message%w
   ├ Failed asserting that false is true.
   │
   ╵ %stests%ebasic%eunit%eStatusTest.php:%d
   ┴

 ✘ Error with message  %f ms
   ┐
   ├ RuntimeException: error with custom message
   │
   ╵ %stests%ebasic%eunit%eStatusTest.php:%d
   ┴

 ∅ Incomplete with message  %f ms
   ┐
   ├ incomplete with custom message
   │
   ╵ %stests%ebasic%eunit%eStatusTest.php:%d
   ┴

 ↩ Skipped with message  %f ms
   ┐
   ├ skipped with custom message
   │
   ╵ %stests%ebasic%eunit%eStatusTest.php:%d
   ┴

 ☢ Risky with message  %f ms
   ┐
   ├ This test did not perform any assertions%w
   ├%w
   ├ %stests%ebasic%eunit%eStatusTest.php:%d%w
   ┴

 ⚠ Warning with message  %f ms
   ┐
   ├ warning with custom message
   │
   ╵ %stests%ebasic%eunit%eStatusTest.php:%d
   ┴

Tear Down After Class (PHPUnit\SelfTest\Basic\TearDownAfterClass)
 ✔ One  %f ms
 ✔ Two  %f ms
 ✘ Tear down after class  0 ms
   ┐
   ├ Exception in PHPUnit\SelfTest\Basic\TearDownAfterClassTest::tearDownAfterClass
   ├ forcing an Exception in tearDownAfterClass()                                  
   │
   ╵ %stests%ebasic%eunit%eTearDownAfterClassTest.php:%d
   ┴

Time: %s, Memory: %s


ERRORS!
Tests: 21, Assertions: 7, Errors: 5, Failures: 3, Warnings: 2, Skipped: 3, Incomplete: 2, Risky: 2.
关于我们 | 顾问团队 | 发展历程 | 联系我们 | 源码上传
联系电话(Tel):4008-010-151(免长途)
地址:北京市海淀区大恒科技大厦五层 邮编:100080
Floor 5th,Daheng Building,Zhongguancun,Beijing,China,100080
51Aspx.com 版权所有 CopyRight © 2006-2022. 京ICP备09089570号 | 京公网安备11010702000869号